HOCO anion
- Formula: CHO2-
- Molecular weight: 45.0180

Reaction thermochemistry data

Data compiled by: John E. Bartmess
Individual Reactions
HO- = CHO2-
By formula: HO- = CHO2-
Quantity | Value | Units | Method | Reference | Comment |
---|---|---|---|---|---|
ΔrH° | 76.3 ± 2.5 | kJ/mol | N/A | Johnson, Harding, et al., 2011 | gas phase; trans isomer. See Wang, Li, et al., 2014 for computational analysis |

Ion clustering data

Data compiled by: John E. Bartmess
Clustering reactions
HO- = CHO2-
By formula: HO- = CHO2-
Quantity | Value | Units | Method | Reference | Comment |
---|---|---|---|---|---|
ΔrH° | 76.3 ± 2.5 | kJ/mol | N/A | Johnson, Harding, et al., 2011 | gas phase; trans isomer. See Wang, Li, et al., 2014 for computational analysis |

References

Johnson, Harding, et al., 2011
Johnson, C.J.; Harding, M.E.; Poad, B.L.J.; Stanton, J.F.; Continetti, R.E.,
Electron Affinities, Well Depths, and Vibrational Spectroscopy of cis- and trans-HOCO,
J. Am. Chem. Soc., 2011, 133, 49, 19606-19609, https://doi.org/10.1021/ja207724f
. [all data]
Wang, Li, et al., 2014
Wang, J.; Li, J.; Ma, J.Y.; Guo, H.,
Full-dimensional characterization of photoelectron spectra of HOCO- and DOCO- and tunneling facilitated decay of HOCO prepared by anion photodetachment,
Journal Of Chemical Physics, 2014, 140, 18, 184314, https://doi.org/10.1063/1.4874975
. [all data]