Cl2Te..Cl anion
- Formula: Cl3Te-
- Molecular weight: 233.96

Reaction thermochemistry data

Data compiled by: John E. Bartmess
Individual Reactions
+ CAS Reg. No. 10025-71-5 = Cl3Te-
By formula: Cl- + CAS Reg. No. 10025-71-5 = Cl3Te-
Quantity | Value | Units | Method | Reference | Comment |
---|---|---|---|---|---|
ΔrH° | 170. ± 7.1 | kJ/mol | CIDT | Lobring, Hao, et al., 2003 | gas phase |

Ion clustering data

Data compiled by: John E. Bartmess
Clustering reactions
+ CAS Reg. No. 10025-71-5 = Cl3Te-
By formula: Cl- + CAS Reg. No. 10025-71-5 = Cl3Te-
Quantity | Value | Units | Method | Reference | Comment |
---|---|---|---|---|---|
ΔrH° | 170. ± 7.1 | kJ/mol | CIDT | Lobring, Hao, et al., 2003 | gas phase |

References

Lobring, Hao, et al., 2003
Lobring, K.C.; Hao, C.T.; Forbes, J.K.; Ivanov, M.R.J.; Bachrach, S.M.; Sunderlin, L.S.,
Bond strengths in ChCl(3)(-) and ChOCl(3)(-) (Ch = S, Se, Te): Experiment and theory,
J. Phys. Chem. A, 2003, 107, 50, 11153-11160, https://doi.org/10.1021/jp030388v
. [all data]