Br2Se..Br anion
- Formula: Br3Se-
- Molecular weight: 318.67

Gas phase thermochemistry data

Data compiled by: John E. Bartmess
Quantity | Value | Units | Method | Reference | Comment |
---|---|---|---|---|---|
ΔfH°gas | -344. ± 12. | kJ/mol | Ther | Lobring, Hao, et al., 2003 |

Ion clustering data

Data compiled by: John E. Bartmess
Clustering reactions
By formula: Br- + Br2Se = Br3Se-
Quantity | Value | Units | Method | Reference | Comment |
---|---|---|---|---|---|
ΔrH° | 110. ± 5.9 | kJ/mol | CIDT | Lobring, Hao, et al., 2003 | gas phase |

References

Lobring, Hao, et al., 2003
Lobring, K.C.; Hao, C.T.; Forbes, J.K.; Ivanov, M.R.J.; Bachrach, S.M.; Sunderlin, L.S.,
Bond strengths in ChCl(3)(-) and ChOCl(3)(-) (Ch = S, Se, Te): Experiment and theory,
J. Phys. Chem. A, 2003, 107, 50, 11153-11160, https://doi.org/10.1021/jp030388v
. [all data]