Cl2Se..Cl anion
- Formula: Cl3Se-
- Molecular weight: 185.32

Gas phase thermochemistry data

Data compiled by: John E. Bartmess
Quantity | Value | Units | Method | Reference | Comment |
---|---|---|---|---|---|
ΔfH°gas | -392.2 | kJ/mol | Ther | Lobring, Hao, et al., 2003 |

Reaction thermochemistry data

Data compiled by: John E. Bartmess
Individual Reactions
By formula: Cl- + Cl2Se = Cl3Se-
Quantity | Value | Units | Method | Reference | Comment |
---|---|---|---|---|---|
ΔrH° | 133. ± 9.2 | kJ/mol | CIDT | Lobring, Hao, et al., 2003 | gas phase |

Ion clustering data

Data compiled by: John E. Bartmess
Clustering reactions
By formula: Cl- + Cl2Se = Cl3Se-
Quantity | Value | Units | Method | Reference | Comment |
---|---|---|---|---|---|
ΔrH° | 133. ± 9.2 | kJ/mol | CIDT | Lobring, Hao, et al., 2003 | gas phase |

References

Lobring, Hao, et al., 2003
Lobring, K.C.; Hao, C.T.; Forbes, J.K.; Ivanov, M.R.J.; Bachrach, S.M.; Sunderlin, L.S.,
Bond strengths in ChCl(3)(-) and ChOCl(3)(-) (Ch = S, Se, Te): Experiment and theory,
J. Phys. Chem. A, 2003, 107, 50, 11153-11160, https://doi.org/10.1021/jp030388v
. [all data]