Fe5O anion

Gas phase ion energetics data

Data compiled by: John E. Bartmess

Electron affinity of neutral species

EAneutral (eV) Method Reference Comment
1.850 ± 0.020LPESGutsev, Bauschlicher, et al., 2003Vertical Detachment Energy: 1.87±0.02 eV

References

Gutsev, Bauschlicher, et al., 2003
Gutsev, G.L.; Bauschlicher, C.W.; Zhai, H.J.; Wang, L.S., Structural and electronic properties of iron monoxide clusters FenO and FenO- (n=2-6): A combined photoelectron spectroscopy, J. Chem. Phys., 2003, 119, 21, 11135-11145, https://doi.org/10.1063/1.1621856 . [all data]