Ar..pyrazine radical anion

Gas phase ion energetics data

Data compiled by: John E. Bartmess

Electron affinity of neutral species

EAneutral (eV) Method Reference Comment
0.025 ± 0.010LPESSong, Lee, et al., 2002

References

Song, Lee, et al., 2002
Song, J.K.; Lee, N.K.; Kim, S.K., Photoelectron spectroscopy of pyrazine anion clusters, J. Chem. Phys., 2002, 117, 4, 1589-1594, https://doi.org/10.1063/1.1488923 . [all data]