Co7O2 radical anion

Gas phase ion energetics data

Data compiled by: John E. Bartmess

Electron affinity of neutral species

EAneutral (eV) Method Reference Comment
1.86 ± 0.23LPESPramann, Koyasu, et al., 2002Vertical Detachment Energy: 2.17±0.23 eV

References

Pramann, Koyasu, et al., 2002
Pramann, A.; Koyasu, K.; Nakajima, A.; Kaya, K., Photoelectron spectroscopy of cobalt oxide cluster anions, J. Phys. Chem. A, 2002, 106, 19, 4891-4896, https://doi.org/10.1021/jp020247d . [all data]