PhCH=NO anion

Reaction thermochemistry data

Data compiled by: John E. Bartmess

Individual Reactions

C7H6NO- + Hydrogen cation = Benzaldehyde, oxime

By formula: C7H6NO- + H+ = C7H7NO

Quantity Value Units Method Reference Comment
Δr1476. ± 14.kJ/molG+TSBartmess, Scott, et al., 1979gas phase; value altered from reference due to change in acidity scale
Quantity Value Units Method Reference Comment
Δr1447. ± 8.4kJ/molIMREBartmess, Scott, et al., 1979gas phase; value altered from reference due to change in acidity scale

References

Bartmess, Scott, et al., 1979
Bartmess, J.E.; Scott, J.A.; McIver, R.T., Jr., The gas phase acidity scale from methanol to phenol, J. Am. Chem. Soc., 1979, 101, 6047. [all data]