PhSiF3..F anion
- Formula: C6H5F4Si-
- Molecular weight: 181.1836

Reaction thermochemistry data

Data compiled by: John E. Bartmess
Individual Reactions
By formula: F- + C6H5F3Si = C6H5F4Si-
Quantity | Value | Units | Method | Reference | Comment |
---|---|---|---|---|---|
ΔrH° | 332. ± 14. | kJ/mol | CIDT | Krouse, Lardin, et al., 2003 | gas phase |

Ion clustering data

Data compiled by: John E. Bartmess
Clustering reactions
By formula: F- + C6H5F3Si = C6H5F4Si-
Quantity | Value | Units | Method | Reference | Comment |
---|---|---|---|---|---|
ΔrH° | 332. ± 14. | kJ/mol | CIDT | Krouse, Lardin, et al., 2003 | gas phase |

Gas phase thermochemistry data

Data compiled by: John E. Bartmess
Quantity | Value | Units | Method | Reference | Comment |
---|---|---|---|---|---|
ΔfH°gas | -1659. ± 16. | kJ/mol | Ther | Krouse, Lardin, et al., 2003 |

References

Krouse, Lardin, et al., 2003
Krouse, I.H.; Lardin, H.A.; Wenthold, P.G.,
Gas-phase ion chemistry and ion thermochemistry of phenyltrifluorosilane,
Int. J. Mass Spectrom., 2003, 227, 3, 303-314, https://doi.org/10.1016/S1387-3806(03)00080-0
. [all data]