adeninide anion
- Formula: C5H4N5-
- Molecular weight: 134.1193
- IUPAC Standard InChIKey: WEENTLLEQNJREA-UHFFFAOYSA-N
- Chemical structure:
View 3d structure (requires JavaScript / HTML 5) - Permanent link for this species. Use this link for bookmarking this species for future reference.

Reaction thermochemistry data

Data compiled by: John E. Bartmess
Individual Reactions
By formula: C5H4N5- + H+ = C5H5N5
Quantity | Value | Units | Method | Reference | Comment |
---|---|---|---|---|---|
ΔrH° | 1402. ± 9.2 | kJ/mol | G+TS | Sharma and Lee, 2002 | gas phase; Acidity at N-9(imidazole N) |
Quantity | Value | Units | Method | Reference | Comment |
ΔrG° | 1372. ± 8.4 | kJ/mol | IMRB | Sharma and Lee, 2002 | gas phase; Acidity at N-9(imidazole N) |
ΔrG° | 1441. ± 17. | kJ/mol | IMRB | Sharma and Lee, 2002 | gas phase; Less acidic N-10 site(aniline) |

Gas phase ion energetics data

Data compiled by: John E. Bartmess
Protonation reactions
By formula: C5H4N5- + H+ = C5H5N5
Quantity | Value | Units | Method | Reference | Comment |
---|---|---|---|---|---|
ΔrH° | 1402. ± 9.2 | kJ/mol | G+TS | Sharma and Lee, 2002 | gas phase; Acidity at N-9(imidazole N) |
Quantity | Value | Units | Method | Reference | Comment |
ΔrG° | 1372. ± 8.4 | kJ/mol | IMRB | Sharma and Lee, 2002 | gas phase; Acidity at N-9(imidazole N) |
ΔrG° | 1441. ± 17. | kJ/mol | IMRB | Sharma and Lee, 2002 | gas phase; Less acidic N-10 site(aniline) |

References

Sharma and Lee, 2002
Sharma, S.; Lee, J.K.,
Acidity of adenine and adenine derivatives and biological implications. A computational and experimental gas-phase study,
J. Org. Chem., 2002, 67, 24, 8360-8365, https://doi.org/10.1021/jo0204303
. [all data]