(benzene)91 radical anion

Gas phase ion energetics data

Data compiled by: John E. Bartmess

Electron affinity of neutral species

EAneutral (eV) Method Reference Comment
0.534 ± 0.025LPESMitsui, Nakajima, et al., 2002Stated electron affinity is the Vertical Detachment Energy

References

Mitsui, Nakajima, et al., 2002
Mitsui, M.; Nakajima, A.; Kaya, K., Negative ion photoelectron spectroscopy of (benzene)(n)(-) (n=53-124) and (toluene)(n)(-) (n=33-139): Solvation energetics of an excess electron in size-selected aromatic hydrocarbon nanoclu, J. Chem. Phys., 2002, 117, 21, 9740-9749, https://doi.org/10.1063/1.1516793 . [all data]