mSCF3-phenoxide anion
- Formula: C7H4F3OS-
- Molecular weight: 193.167

Reaction thermochemistry data

Data compiled by: John E. Bartmess
Individual Reactions
C7H4F3OS- + = C7H5F3OS
By formula: C7H4F3OS- + H+ = C7H5F3OS
Quantity | Value | Units | Method | Reference | Comment |
---|---|---|---|---|---|
ΔrH° | 337.2 ± 2.1 | kcal/mol | G+TS | Taft and Topsom, 1987 | gas phase |
Quantity | Value | Units | Method | Reference | Comment |
ΔrG° | 330.4 ± 2.0 | kcal/mol | IMRE | Taft and Topsom, 1987 | gas phase |

Gas phase ion energetics data

Data compiled by: John E. Bartmess
Electron affinity of neutral species
EAneutral (eV) | Method | Reference | Comment |
---|---|---|---|
2.72327 | D-EA | Taft and Topsom, 1987 |
Protonation reactions
C7H4F3OS- + = C7H5F3OS
By formula: C7H4F3OS- + H+ = C7H5F3OS
Quantity | Value | Units | Method | Reference | Comment |
---|---|---|---|---|---|
ΔrH° | 337.2 ± 2.1 | kcal/mol | G+TS | Taft and Topsom, 1987 | gas phase |
Quantity | Value | Units | Method | Reference | Comment |
ΔrG° | 330.4 ± 2.0 | kcal/mol | IMRE | Taft and Topsom, 1987 | gas phase |

References

Taft and Topsom, 1987
Taft, R.W.; Topsom, R.D.,
The Nature and Analysis of Substituent Effects,
Prog. Phys. Org. Chem., 1987, 16, 1. [all data]