7-nBu-cycloheptatrienide anion
- Formula: C11H15-
- Molecular weight: 147.2373

Gas phase ion energetics data

Data compiled by: John E. Bartmess
Protonation reactions
C11H15- + = C11H16
By formula: C11H15- + H+ = C11H16
Quantity | Value | Units | Method | Reference | Comment |
---|---|---|---|---|---|
ΔrH° | 368.7 ± 2.5 | kcal/mol | G+TS | Mishima, Kinoshita, et al., 2002 | gas phase; Reprotonation likely to be on C-1, giving 1-alkyl-cycloheptatriene - JEB |
Quantity | Value | Units | Method | Reference | Comment |
ΔrG° | 361.0 ± 2.0 | kcal/mol | IMRE | Mishima, Kinoshita, et al., 2002 | gas phase; Reprotonation likely to be on C-1, giving 1-alkyl-cycloheptatriene - JEB |

Reaction thermochemistry data

Data compiled by: John E. Bartmess
Individual Reactions
C11H15- + = C11H16
By formula: C11H15- + H+ = C11H16
Quantity | Value | Units | Method | Reference | Comment |
---|---|---|---|---|---|
ΔrH° | 368.7 ± 2.5 | kcal/mol | G+TS | Mishima, Kinoshita, et al., 2002 | gas phase; Reprotonation likely to be on C-1, giving 1-alkyl-cycloheptatriene - JEB |
Quantity | Value | Units | Method | Reference | Comment |
ΔrG° | 361.0 ± 2.0 | kcal/mol | IMRE | Mishima, Kinoshita, et al., 2002 | gas phase; Reprotonation likely to be on C-1, giving 1-alkyl-cycloheptatriene - JEB |

References

Mishima, Kinoshita, et al., 2002
Mishima, M.; Kinoshita, T.; Hattori, Y.; Takeuchi, K.,
Gas-phase acidities of cycloheptatrienes: effects of alkyl groups on the stability of carbanions,
Eur. J. Mass Spectrom., 2002, 8, 1, 359-366, https://doi.org/10.1255/ejms.499
. [all data]