7-Me-cycloheptatrienide anion
- Formula: C8H9-
- Molecular weight: 105.1576

Gas phase ion energetics data

Data compiled by: John E. Bartmess
Protonation reactions
By formula: C8H9- + H+ = C8H10
Quantity | Value | Units | Method | Reference | Comment |
---|---|---|---|---|---|
ΔrH° | 1552. ± 10. | kJ/mol | G+TS | Mishima, Kinoshita, et al., 2002 | gas phase; Reprotonation likely to be on C-1, giving 1-alkyl-cycloheptatriene - JEB |
Quantity | Value | Units | Method | Reference | Comment |
ΔrG° | 1520. ± 8.4 | kJ/mol | IMRE | Mishima, Kinoshita, et al., 2002 | gas phase; Reprotonation likely to be on C-1, giving 1-alkyl-cycloheptatriene - JEB |

References

Mishima, Kinoshita, et al., 2002
Mishima, M.; Kinoshita, T.; Hattori, Y.; Takeuchi, K.,
Gas-phase acidities of cycloheptatrienes: effects of alkyl groups on the stability of carbanions,
Eur. J. Mass Spectrom., 2002, 8, 1, 359-366, https://doi.org/10.1255/ejms.499
. [all data]