PtO anion

Gas phase thermochemistry data

Data compiled by: John E. Bartmess

Quantity Value Units Method Reference Comment
Δfgas210. ± 42.kJ/molR-EARamond, Davico, et al., 2002

Gas phase ion energetics data

Data compiled by: John E. Bartmess

Electron affinity of neutral species

EAneutral (eV) Method Reference Comment
2.1720 ± 0.0050LPESRamond, Davico, et al., 2002

References

Ramond, Davico, et al., 2002
Ramond, T.M.; Davico, G.E.; Hellberg, F.; Svedberg, F.; Salen, P.; Soderqvist, P.; Lineberger, W.C., Photoelectron spectroscopy of nickel, palladium, and platinum oxide anions, J. Molec. Spectros., 2002, 216, 1, 1-14, https://doi.org/10.1006/jmsp.2002.8669 . [all data]