mCO2Me-phenoxide anion

Gas phase ion energetics data

Data compiled by: John E. Bartmess

Electron affinity of neutral species

EAneutral (eV) Method Reference Comment
2.61 ± 0.12D-EAFujio, McIver, et al., 1981

Protonation reactions

C8H7O3- + Hydrogen cation = Benzoic acid, 3-hydroxy-, methyl ester

By formula: C8H7O3- + H+ = C8H8O3

Quantity Value Units Method Reference Comment
Δr1438. ± 8.8kJ/molG+TSFujio, McIver, et al., 1981gas phase
Quantity Value Units Method Reference Comment
Δr1410. ± 8.4kJ/molIMREFujio, McIver, et al., 1981gas phase

Reaction thermochemistry data

Data compiled by: John E. Bartmess

Individual Reactions

C8H7O3- + Hydrogen cation = Benzoic acid, 3-hydroxy-, methyl ester

By formula: C8H7O3- + H+ = C8H8O3

Quantity Value Units Method Reference Comment
Δr1438. ± 8.8kJ/molG+TSFujio, McIver, et al., 1981gas phase
Quantity Value Units Method Reference Comment
Δr1410. ± 8.4kJ/molIMREFujio, McIver, et al., 1981gas phase

References

Fujio, McIver, et al., 1981
Fujio, M.; McIver, R.T., Jr.; Taft, R.W., Effects on the acidities of phenols from specific substituent-solvent interactions. Inherent substituent parameters from gas phase acidities, J. Am. Chem. Soc., 1981, 103, 4017. [all data]