FeH anion

Gas phase ion energetics data

Data compiled by: John E. Bartmess

Protonation reactions

HFe- + Hydrogen cation = H2Fe

By formula: HFe- + H+ = H2Fe

Quantity Value Units Method Reference Comment
Δr1497.3kJ/molAcidStevens, Feigerle, et al., 1983gas phase

Reaction thermochemistry data

Data compiled by: John E. Bartmess

Individual Reactions

HFe- + Hydrogen cation = H2Fe

By formula: HFe- + H+ = H2Fe

Quantity Value Units Method Reference Comment
Δr1497.3kJ/molAcidStevens, Feigerle, et al., 1983gas phase

Gas phase thermochemistry data

Data compiled by: John E. Bartmess

Quantity Value Units Method Reference Comment
Δfgas91.1 ± 7.0kcal/molR-EAStevens, Feigerle, et al., 1983

References

Stevens, Feigerle, et al., 1983
Stevens, A.E.; Feigerle, C.S.; Lineberger, W.C., Laser photoelectron spectroscopy of MnH- and FeH-: Electronic structures of the metal hydrides, identification of a low spin excited state of MnH, J. Chem. Phys., 1983, 78, 5420. [all data]