PBr4 anion
- Formula: Br4P-
- Molecular weight: 350.590

Gas phase thermochemistry data

Data compiled by: John E. Bartmess
Quantity | Value | Units | Method | Reference | Comment |
---|---|---|---|---|---|
ΔfH°gas | -99.6 ± 2.5 | kcal/mol | Ther | Heil, Check, et al., 2002 |

Reaction thermochemistry data

Data compiled by: John E. Bartmess
Individual Reactions
By formula: Br- + Br3P = Br4P-
Quantity | Value | Units | Method | Reference | Comment |
---|---|---|---|---|---|
ΔrH° | 15.5 ± 1.4 | kcal/mol | CIDT | Heil, Check, et al., 2002 | gas phase |

Ion clustering data

Data compiled by: John E. Bartmess
Clustering reactions
By formula: Br- + Br3P = Br4P-
Quantity | Value | Units | Method | Reference | Comment |
---|---|---|---|---|---|
ΔrH° | 15.5 ± 1.4 | kcal/mol | CIDT | Heil, Check, et al., 2002 | gas phase |

References

Heil, Check, et al., 2002
Heil, T.E.; Check, C.E.; Lobring, K.C.; Sunderlin, L.S.,
The thermochemistry of phosphorus tetrahalide anions,
J. Phys. Chem. A, 2002, 106, 42, 10043-10048, https://doi.org/10.1021/jp021386y
. [all data]