(naphthalene)2..NO radical anion

Reaction thermochemistry data

Data compiled by: John E. Bartmess

Individual Reactions

C10H8NO- + 2Naphthalene = C20H16NO-

By formula: C10H8NO- + 2C10H8 = C20H16NO-

Quantity Value Units Method Reference Comment
Δr99.6 ± 9.6kJ/molN/ALe Barbu, Schiedt, et al., 2002gas phase; Affinity is difference in EAs of lesser solvated species

Ion clustering data

Data compiled by: John E. Bartmess

Clustering reactions

C10H8NO- + 2Naphthalene = C20H16NO-

By formula: C10H8NO- + 2C10H8 = C20H16NO-

Quantity Value Units Method Reference Comment
Δr23.8 ± 2.3kcal/molN/ALe Barbu, Schiedt, et al., 2002gas phase; Affinity is difference in EAs of lesser solvated species

References

Le Barbu, Schiedt, et al., 2002
Le Barbu, K.; Schiedt, J.; Weinkauf, R.; Schlag, E.W.; Nilles, J.M.; Xu, S.J.; Thomas, O.C.; Bowen, K.H., Microsolvation of small anions by aromatic molecules: An exploratory study, J. Chem. Phys., 2002, 116, 22, 9663-9671, https://doi.org/10.1063/1.1475750 . [all data]