naphthalene..{H2O}2..O2 radical anion
- Formula: C10H12O4-
- Molecular weight: 196.2004

Gas phase ion energetics data

Data compiled by: John E. Bartmess
Electron affinity of neutral species
EAneutral (eV) | Method | Reference | Comment |
---|---|---|---|
2.72 ± 0.10 | LPES | Le Barbu, Schiedt, et al., 2002 | Affinity is difference in EAs of lesser solvated species |

Ion clustering data

Data compiled by: John E. Bartmess
Clustering reactions
H4O4- + + 2
= C10H12O4-
By formula: H4O4- + C10H8 + 2H2O = C10H12O4-
Quantity | Value | Units | Method | Reference | Comment |
---|---|---|---|---|---|
ΔrH° | 52.3 ± 2.3 | kcal/mol | N/A | Le Barbu, Schiedt, et al., 2002 | gas phase; Affinity is difference in EAs of lesser solvated species |

Reaction thermochemistry data

Data compiled by: John E. Bartmess

Individual Reactions

H4O4- + Naphthalene + 2Water = C10H12O4-

By formula: H4O4- + C10H8 + 2H2O = C10H12O4-

Quantity Value Units Method Reference Comment
Δr219. ± 9.6kJ/molN/ALe Barbu, Schiedt, et al., 2002gas phase; Affinity is difference in EAs of lesser solvated species

References

Le Barbu, Schiedt, et al., 2002
Le Barbu, K.; Schiedt, J.; Weinkauf, R.; Schlag, E.W.; Nilles, J.M.; Xu, S.J.; Thomas, O.C.; Bowen, K.H.,
Microsolvation of small anions by aromatic molecules: An exploratory study,
J. Chem. Phys., 2002, 116, 22, 9663-9671, https://doi.org/10.1063/1.1475750
. [all data]