naphthalene..{H2O}..O2 radical anion
- Formula: C10H10O3-
- Molecular weight: 178.1851

Gas phase ion energetics data

Data compiled by: John E. Bartmess
Electron affinity of neutral species
EAneutral (eV) | Method | Reference | Comment |
---|---|---|---|
2.09 ± 0.10 | LPES | Le Barbu, Schiedt, et al., 2002 | Affinity is difference in EAs of lesser solvated species |

Ion clustering data

Data compiled by: John E. Bartmess
Clustering reactions
H2O3- + +
= C10H10O3-
By formula: H2O3- + C10H8 + H2O = C10H10O3-
Quantity | Value | Units | Method | Reference | Comment |
---|---|---|---|---|---|
ΔrH° | 37.8 ± 2.3 | kcal/mol | N/A | Le Barbu, Schiedt, et al., 2002 | gas phase; Affinity is difference in EAs of lesser solvated species |

Reaction thermochemistry data

Data compiled by: John E. Bartmess

Individual Reactions

H2O3- + Naphthalene + Water = C10H10O3-

By formula: H2O3- + C10H8 + H2O = C10H10O3-

Quantity Value Units Method Reference Comment
Δr158. ± 9.6kJ/molN/ALe Barbu, Schiedt, et al., 2002gas phase; Affinity is difference in EAs of lesser solvated species

References

Le Barbu, Schiedt, et al., 2002
Le Barbu, K.; Schiedt, J.; Weinkauf, R.; Schlag, E.W.; Nilles, J.M.; Xu, S.J.; Thomas, O.C.; Bowen, K.H.,
Microsolvation of small anions by aromatic molecules: An exploratory study,
J. Chem. Phys., 2002, 116, 22, 9663-9671, https://doi.org/10.1063/1.1475750
. [all data]