pyridine..{H2O}..O2 radical anion
- Formula: C5H7NO3-
- Molecular weight: 129.1145

Ion clustering data

Data compiled by: John E. Bartmess
Clustering reactions
H2O3- + +
= C5H7NO3-
By formula: H2O3- + C5H5N + H2O = C5H7NO3-
Quantity | Value | Units | Method | Reference | Comment |
---|---|---|---|---|---|
ΔrH° | 137. ± 9.6 | kJ/mol | N/A | Le Barbu, Schiedt, et al., 2002 | gas phase; Affinity is difference in EAs of lesser solvated species |

Gas phase ion energetics data

Data compiled by: John E. Bartmess

Electron affinity of neutral species

EAneutral (eV) Method Reference Comment
1.87 ± 0.10LPESLe Barbu, Schiedt, et al., 2002Affinity is difference in EAs of lesser solvated species

Reaction thermochemistry data

Data compiled by: John E. Bartmess

Individual Reactions

H2O3- + Pyridine + Water = C5H7NO3-

By formula: H2O3- + C5H5N + H2O = C5H7NO3-

Quantity Value Units Method Reference Comment
Δr32.7 ± 2.3kcal/molN/ALe Barbu, Schiedt, et al., 2002gas phase; Affinity is difference in EAs of lesser solvated species

References

Le Barbu, Schiedt, et al., 2002
Le Barbu, K.; Schiedt, J.; Weinkauf, R.; Schlag, E.W.; Nilles, J.M.; Xu, S.J.; Thomas, O.C.; Bowen, K.H.,
Microsolvation of small anions by aromatic molecules: An exploratory study,
J. Chem. Phys., 2002, 116, 22, 9663-9671, https://doi.org/10.1063/1.1475750
. [all data]