CF3H..PhCðC anion
- Formula: C9H6F3-
- Molecular weight: 171.1397

Reaction thermochemistry data

Data compiled by: John E. Bartmess
Individual Reactions
C8H5- + = C9H6F3-
By formula: C8H5- + CHF3 = C9H6F3-
Quantity | Value | Units | Method | Reference | Comment |
---|---|---|---|---|---|
ΔrH° | 19.3 ± 1.0 | kcal/mol | IMRE | Chabinyc and Brauman, 2000 | gas phase; Original dG=8.8 at 350K; dS based on symmetry alone |
Quantity | Value | Units | Method | Reference | Comment |
ΔrG° | 10.4 ± 1.0 | kcal/mol | IMRE | Chabinyc and Brauman, 2000 | gas phase; Original dG=8.8 at 350K; dS based on symmetry alone |

Ion clustering data

Data compiled by: John E. Bartmess
Clustering reactions
C8H5- + = C9H6F3-
By formula: C8H5- + CHF3 = C9H6F3-
Quantity | Value | Units | Method | Reference | Comment |
---|---|---|---|---|---|
ΔrH° | 19.3 ± 1.0 | kcal/mol | IMRE | Chabinyc and Brauman, 2000 | gas phase; Original dG=8.8 at 350K; dS based on symmetry alone |
Quantity | Value | Units | Method | Reference | Comment |
ΔrG° | 10.4 ± 1.0 | kcal/mol | IMRE | Chabinyc and Brauman, 2000 | gas phase; Original dG=8.8 at 350K; dS based on symmetry alone |

References

Chabinyc and Brauman, 2000
Chabinyc, M.L.; Brauman, J.I.,
Unusual ionic hydrogen bonds: Complexes of acetylides and fluoroform,
J. Am. Chem. Soc., 2000, 122, 36, 8739-8745, https://doi.org/10.1021/ja000806z
. [all data]