CF3H..pMe-C6H4CðC anion
- Formula: C10H8F3-
- Molecular weight: 185.1663

Reaction thermochemistry data

Data compiled by: John E. Bartmess
Individual Reactions
C9H7- + = C10H8F3-
By formula: C9H7- + CHF3 = C10H8F3-
Quantity | Value | Units | Method | Reference | Comment |
---|---|---|---|---|---|
ΔrH° | 78.7 ± 4.2 | kJ/mol | IMRE | Chabinyc and Brauman, 2000 | gas phase; Original dG=8.3 at 350K; dS based on symmetry alone |
Quantity | Value | Units | Method | Reference | Comment |
ΔrG° | 41. ± 4.2 | kJ/mol | IMRE | Chabinyc and Brauman, 2000 | gas phase; Original dG=8.3 at 350K; dS based on symmetry alone |

Ion clustering data

Data compiled by: John E. Bartmess
Clustering reactions
C9H7- + = C10H8F3-
By formula: C9H7- + CHF3 = C10H8F3-
Quantity | Value | Units | Method | Reference | Comment |
---|---|---|---|---|---|
ΔrH° | 78.7 ± 4.2 | kJ/mol | IMRE | Chabinyc and Brauman, 2000 | gas phase; Original dG=8.3 at 350K; dS based on symmetry alone |
Quantity | Value | Units | Method | Reference | Comment |
ΔrG° | 41. ± 4.2 | kJ/mol | IMRE | Chabinyc and Brauman, 2000 | gas phase; Original dG=8.3 at 350K; dS based on symmetry alone |

Gas phase thermochemistry data

Data compiled by: John E. Bartmess
Quantity | Value | Units | Method | Reference | Comment |
---|---|---|---|---|---|
ΔfH°gas | -471. ± 12. | kJ/mol | Ther | Chabinyc and Brauman, 2000 | Original dG=8.3 at 350K; dS based on symmetry alone |

References

Chabinyc and Brauman, 2000
Chabinyc, M.L.; Brauman, J.I.,
Unusual ionic hydrogen bonds: Complexes of acetylides and fluoroform,
J. Am. Chem. Soc., 2000, 122, 36, 8739-8745, https://doi.org/10.1021/ja000806z
. [all data]