CD3OH..HCðC anion
- Formula: C3H2D5-
- Molecular weight: 48.1190

Reaction thermochemistry data

Data compiled by: John E. Bartmess
Individual Reactions
C2H- + = C3H2D5-
By formula: C2H- + CD4O = C3H2D5-
Quantity | Value | Units | Method | Reference | Comment |
---|---|---|---|---|---|
ΔrH° | 21.4 ± 1.0 | kcal/mol | IMRE | Chabinyc and Brauman, 2000 | gas phase; Original dG=11.3 at 350K; dS based on symmetry alone |
Quantity | Value | Units | Method | Reference | Comment |
ΔrG° | 12.8 ± 1.0 | kcal/mol | IMRE | Chabinyc and Brauman, 2000 | gas phase; Original dG=11.3 at 350K; dS based on symmetry alone |

Ion clustering data

Data compiled by: John E. Bartmess
Clustering reactions
C2H- + = C3H2D5-
By formula: C2H- + CD4O = C3H2D5-
Quantity | Value | Units | Method | Reference | Comment |
---|---|---|---|---|---|
ΔrH° | 21.4 ± 1.0 | kcal/mol | IMRE | Chabinyc and Brauman, 2000 | gas phase; Original dG=11.3 at 350K; dS based on symmetry alone |
Quantity | Value | Units | Method | Reference | Comment |
ΔrG° | 12.8 ± 1.0 | kcal/mol | IMRE | Chabinyc and Brauman, 2000 | gas phase; Original dG=11.3 at 350K; dS based on symmetry alone |

References

Chabinyc and Brauman, 2000
Chabinyc, M.L.; Brauman, J.I.,
Unusual ionic hydrogen bonds: Complexes of acetylides and fluoroform,
J. Am. Chem. Soc., 2000, 122, 36, 8739-8745, https://doi.org/10.1021/ja000806z
. [all data]