W4 radical anion

Gas phase ion energetics data

Data compiled by: John E. Bartmess

Electron affinity of neutral species

EAneutral (eV) Method Reference Comment
1.640 ± 0.050LPESWeidele, Kreisle, et al., 1995Stated EA is Vertical Detachment Energy. See Stanzel, Burmeister, et al., 2010 for time-resolved behavior

References

Weidele, Kreisle, et al., 1995
Weidele, H.; Kreisle, D.; Recknagel, E.; Icking-Konert, G.S.; Handschuh, H.; Gantefor, G.; Eberhardt, W., Thermionic Emission from Small Clusters: Direct Observation of the Kinetic Energy Distribution of the Electrons., Chem. Phys. Lett., 1995, 237, 5-6, 425., https://doi.org/10.1016/0009-2614(95)00344-4 . [all data]

Stanzel, Burmeister, et al., 2010
Stanzel, J.; Burmeister, F.; Neeb, M., Time-resolved photoelectron spectroscopy on small tungsten cluster anions, Appl. Phys. A, 2010, 100, 1, 21-29, https://doi.org/10.1007/s00339-010-5611-6 . [all data]