(D2O)2..O radical anion

Gas phase thermochemistry data

Data compiled by: John E. Bartmess

Quantity Value Units Method Reference Comment
Δfgas-562.08kJ/molTherClements, Luong, et al., 2001

Reaction thermochemistry data

Data compiled by: John E. Bartmess

Individual Reactions

D2O2- + 2Deuterium oxide = D4O3-

By formula: D2O2- + 2D2O = D4O3-

Quantity Value Units Method Reference Comment
Δr18.7 ± 1.8kcal/molLPESClements, Luong, et al., 2001gas phase

Ion clustering data

Data compiled by: John E. Bartmess

Clustering reactions

D2O2- + 2Deuterium oxide = D4O3-

By formula: D2O2- + 2D2O = D4O3-

Quantity Value Units Method Reference Comment
Δr18.7 ± 1.8kcal/molLPESClements, Luong, et al., 2001gas phase

References

Clements, Luong, et al., 2001
Clements, T.G.; Luong, A.K.; Deyerl, H.J.; Continetti, R.E., Dissociative photodetachment studies of O-(H2O)(2), OH- (H2O)(2), and the deuterated isotopomers: Energetics and three- body dissociation dynamics, J. Chem. Phys., 2001, 114, 19, 8436-8444, https://doi.org/10.1063/1.1366332 . [all data]