(H2O)2..O radical anion
- Formula: H4O3-
- Molecular weight: 52.0305

Gas phase thermochemistry data

Data compiled by: John E. Bartmess
Quantity | Value | Units | Method | Reference | Comment |
---|---|---|---|---|---|
ΔfH°gas | -134.52 | kcal/mol | Ther | Clements, Luong, et al., 2001 |

Ion clustering data

Data compiled by: John E. Bartmess
Clustering reactions
H2O2- + 2 = H4O3-
By formula: H2O2- + 2H2O = H4O3-
Quantity | Value | Units | Method | Reference | Comment |
---|---|---|---|---|---|
ΔrH° | 18.4 ± 1.8 | kcal/mol | LPES | Clements, Luong, et al., 2001 | gas phase |

References

Clements, Luong, et al., 2001
Clements, T.G.; Luong, A.K.; Deyerl, H.J.; Continetti, R.E.,
Dissociative photodetachment studies of O-(H2O)(2), OH- (H2O)(2), and the deuterated isotopomers: Energetics and three- body dissociation dynamics,
J. Chem. Phys., 2001, 114, 19, 8436-8444, https://doi.org/10.1063/1.1366332
. [all data]