Tb3OSi3 radical anion

Gas phase ion energetics data

Data compiled by: John E. Bartmess

Electron affinity of neutral species

EAneutral (eV) Method Reference Comment
0.98 ± 0.10LPESOhara, Miyajima, et al., 2007

References

Ohara, Miyajima, et al., 2007
Ohara, M.; Miyajima, K.; Pramann, A.; Nakajima, A.; Kaya, K., Geometric and electronic structures of terbium-silicon mixed clusters (TbSin; 6 = n = 16). Correction., J. Phys. Chem. A, 2007, 111, 42, 10884, https://doi.org/10.1021/jp076626u . [all data]