AsCl3..Cl anion
- Formula: AsCl4-
- Molecular weight: 216.734

Gas phase thermochemistry data

Data compiled by: John E. Bartmess
Quantity | Value | Units | Method | Reference | Comment |
---|---|---|---|---|---|
ΔfH°gas | -603.88 | kJ/mol | Ther | Walker, Check, et al., 2002 |

Reaction thermochemistry data

Data compiled by: John E. Bartmess
Individual Reactions
By formula: Cl- + AsCl3 = AsCl4-
Quantity | Value | Units | Method | Reference | Comment |
---|---|---|---|---|---|
ΔrH° | 115. ± 7.1 | kJ/mol | CIDT | Walker, Check, et al., 2002 | gas phase |

Ion clustering data

Data compiled by: John E. Bartmess
Clustering reactions
By formula: Cl- + AsCl3 = AsCl4-
Quantity | Value | Units | Method | Reference | Comment |
---|---|---|---|---|---|
ΔrH° | 115. ± 7.1 | kJ/mol | CIDT | Walker, Check, et al., 2002 | gas phase |

References

Walker, Check, et al., 2002
Walker, B.W.; Check, C.E.; Lobring, K.C.; Pommerening, C.A.; Sunderlin, L.S.,
The Thermochemistry of Group 15 Tetrachloride Anions,
J. Am. Soc. Mass Spectrom., 2002, 13, 5, 469, https://doi.org/10.1016/S1044-0305(02)00369-0
. [all data]