NH3..NO anion

Gas phase ion energetics data

Data compiled by: John E. Bartmess

Electron affinity of neutral species

EAneutral (eV) Method Reference Comment
0.480 ± 0.020LPESHendricks, de Clercq, et al., 2002

Reaction thermochemistry data

Data compiled by: John E. Bartmess

Individual Reactions

Nitric oxide anion + Ammonia = H3N2O-

By formula: NO- + H3N = H3N2O-

Quantity Value Units Method Reference Comment
Δr10.40kcal/molN/AHendricks, de Clercq, et al., 2002gas phase

Ion clustering data

Data compiled by: John E. Bartmess

Clustering reactions

Nitric oxide anion + Ammonia = H3N2O-

By formula: NO- + H3N = H3N2O-

Quantity Value Units Method Reference Comment
Δr10.40kcal/molN/AHendricks, de Clercq, et al., 2002gas phase

References

Hendricks, de Clercq, et al., 2002
Hendricks, J.H.; de Clercq, H.L.; Freidhoff, C.B.; Arnold, S.T.; Eaton, J.G.; Fancher, C.; Lyapustina, S.A.; S., Anion solvation at the microscopic level: Photoelectron spectroscopy of the solvated anion clusters, NO-(Y)(n), where Y=Ar, Kr, Xe, N2O, H2S, NH3, H2O, and C2H4(OH)(2), J. Chem. Phys., 2002, 116, 18, 7926-7938, https://doi.org/10.1063/1.1457444 . [all data]