H2S..NO anion
- Formula: H2NOS-
- Molecular weight: 64.088

Ion clustering data

Data compiled by: John E. Bartmess
Clustering reactions
By formula: NO- + H2S = H2NOS-
Quantity | Value | Units | Method | Reference | Comment |
---|---|---|---|---|---|
ΔrH° | 23.4 | kJ/mol | N/A | Hendricks, de Clercq, et al., 2002 | gas phase |

Reaction thermochemistry data

Data compiled by: John E. Bartmess

Individual Reactions

Nitric oxide anion + Hydrogen sulfide = H2NOS-

By formula: NO- + H2S = H2NOS-

Quantity Value Units Method Reference Comment
Δr5.60kcal/molN/AHendricks, de Clercq, et al., 2002gas phase

Gas phase ion energetics data

Data compiled by: John E. Bartmess

Electron affinity of neutral species

EAneutral (eV) Method Reference Comment
0.268 ± 0.020LPESHendricks, de Clercq, et al., 2002

References

Hendricks, de Clercq, et al., 2002
Hendricks, J.H.; de Clercq, H.L.; Freidhoff, C.B.; Arnold, S.T.; Eaton, J.G.; Fancher, C.; Lyapustina, S.A.; S.,
Anion solvation at the microscopic level: Photoelectron spectroscopy of the solvated anion clusters, NO-(Y)(n), where Y=Ar, Kr, Xe, N2O, H2S, NH3, H2O, and C2H4(OH)(2),
J. Chem. Phys., 2002, 116, 18, 7926-7938, https://doi.org/10.1063/1.1457444
. [all data]