(Xe)3..NO anion
- Formula: NOXe3-
- Molecular weight: 423.886

Ion clustering data

Data compiled by: John E. Bartmess
Clustering reactions
NOXe2- + 3 = NOXe3-
By formula: NOXe2- + 3Xe = NOXe3-
Quantity | Value | Units | Method | Reference | Comment |
---|---|---|---|---|---|
ΔrH° | 3.50 | kcal/mol | N/A | Hendricks, de Clercq, et al., 2002 | gas phase |
NOXe3- + 4 = NOXe4-
By formula: NOXe3- + 4Xe = NOXe4-
Quantity | Value | Units | Method | Reference | Comment |
---|---|---|---|---|---|
ΔrH° | 0.30 | kcal/mol | N/A | Hendricks, de Clercq, et al., 2002 | gas phase |

References

Hendricks, de Clercq, et al., 2002
Hendricks, J.H.; de Clercq, H.L.; Freidhoff, C.B.; Arnold, S.T.; Eaton, J.G.; Fancher, C.; Lyapustina, S.A.; S.,
Anion solvation at the microscopic level: Photoelectron spectroscopy of the solvated anion clusters, NO-(Y)(n), where Y=Ar, Kr, Xe, N2O, H2S, NH3, H2O, and C2H4(OH)(2),
J. Chem. Phys., 2002, 116, 18, 7926-7938, https://doi.org/10.1063/1.1457444
. [all data]