(Ar)6..NO anion

Reaction thermochemistry data

Data compiled by: John E. Bartmess

Individual Reactions

Ar5NO- + 6Argon = Ar6NO-

By formula: Ar5NO- + 6Ar = Ar6NO-

Quantity Value Units Method Reference Comment
Δr5.02kJ/molN/AHendricks, de Clercq, et al., 2002gas phase

Ar6NO- + 7Argon = Ar7NO-

By formula: Ar6NO- + 7Ar = Ar7NO-

Quantity Value Units Method Reference Comment
Δr3.8kJ/molN/AHendricks, de Clercq, et al., 2002gas phase

References

Hendricks, de Clercq, et al., 2002
Hendricks, J.H.; de Clercq, H.L.; Freidhoff, C.B.; Arnold, S.T.; Eaton, J.G.; Fancher, C.; Lyapustina, S.A.; S., Anion solvation at the microscopic level: Photoelectron spectroscopy of the solvated anion clusters, NO-(Y)(n), where Y=Ar, Kr, Xe, N2O, H2S, NH3, H2O, and C2H4(OH)(2), J. Chem. Phys., 2002, 116, 18, 7926-7938, https://doi.org/10.1063/1.1457444 . [all data]