Tb3Cl9..TbCl4 anion
- Formula: Cl13Tb4-
- Molecular weight: 1096.591

Gas phase thermochemistry data

Data compiled by: John E. Bartmess
Quantity | Value | Units | Method | Reference | Comment |
---|---|---|---|---|---|
ΔfH°gas | -4247. ± 50. | kJ/mol | Ther | Khasanshin, Kudin, et al., 1999 | value altered from reference due to conversion from electron convention to ion convention |

Reaction thermochemistry data

Data compiled by: John E. Bartmess
Individual Reactions
By formula: TbCl4- + 3Cl3Tb = Cl13Tb4-
Quantity | Value | Units | Method | Reference | Comment |
---|---|---|---|---|---|
ΔrH° | 76. ± 20. | kcal/mol | TDEq | Khasanshin, Kudin, et al., 1999 | gas phase; value altered from reference due to conversion from electron convention to ion convention |

Ion clustering data

Data compiled by: John E. Bartmess
Clustering reactions
By formula: TbCl4- + 3Cl3Tb = Cl13Tb4-
Quantity | Value | Units | Method | Reference | Comment |
---|---|---|---|---|---|
ΔrH° | 76. ± 20. | kcal/mol | TDEq | Khasanshin, Kudin, et al., 1999 | gas phase; value altered from reference due to conversion from electron convention to ion convention |

References

Khasanshin, Kudin, et al., 1999
Khasanshin, I.V.; Kudin, L.S.; Pogrebnoi, A.M.,
A mass spectrometric study of saturated vapor over terbium trichloride and the TbCl3-DyCl3 system,
Russ. J. Phys. Chem., 1999, 73, 849-855. [all data]