Tb3Cl10 anion
- Formula: Cl10Tb3-
- Molecular weight: 831.307

Gas phase thermochemistry data

Data compiled by: John E. Bartmess
Quantity | Value | Units | Method | Reference | Comment |
---|---|---|---|---|---|
ΔfH°gas | -3212. ± 40. | kJ/mol | Ther | Khasanshin, Kudin, et al., 1999 | value altered from reference due to conversion from electron convention to ion convention |

Reaction thermochemistry data

Data compiled by: John E. Bartmess
Individual Reactions
By formula: TbCl4- + 2Cl3Tb = Cl10Tb3-
Quantity | Value | Units | Method | Reference | Comment |
---|---|---|---|---|---|
ΔrH° | 390. ± 9.6 | kJ/mol | TDEq | Khasanshin, Kudin, et al., 1999 | gas phase; value altered from reference due to conversion from electron convention to ion convention |

Ion clustering data

Data compiled by: John E. Bartmess
Clustering reactions
By formula: TbCl4- + 2Cl3Tb = Cl10Tb3-
Quantity | Value | Units | Method | Reference | Comment |
---|---|---|---|---|---|
ΔrH° | 93.3 ± 2.3 | kcal/mol | TDEq | Khasanshin, Kudin, et al., 1999 | gas phase; value altered from reference due to conversion from electron convention to ion convention |

References

Khasanshin, Kudin, et al., 1999
Khasanshin, I.V.; Kudin, L.S.; Pogrebnoi, A.M.,
A mass spectrometric study of saturated vapor over terbium trichloride and the TbCl3-DyCl3 system,
Russ. J. Phys. Chem., 1999, 73, 849-855. [all data]