Tb2Cl7 anion
- Formula: Cl7Tb2-
- Molecular weight: 566.022

Gas phase thermochemistry data

Data compiled by: John E. Bartmess
Quantity | Value | Units | Method | Reference | Comment |
---|---|---|---|---|---|
ΔfH°gas | -2255. ± 30. | kJ/mol | Ther | Kudin, Vorob'ev, et al., 2007 | value altered from reference due to conversion from electron convention to ion convention |
ΔfH°gas | -2244. ± 30. | kJ/mol | Ther | Khasanshin, Kudin, et al., 1999 | value altered from reference due to conversion from electron convention to ion convention |

Reaction thermochemistry data

Data compiled by: John E. Bartmess
Individual Reactions
By formula: TbCl4- + Cl3Tb = Cl7Tb2-
Quantity | Value | Units | Method | Reference | Comment |
---|---|---|---|---|---|
ΔrH° | 242. ± 38. | kJ/mol | TDEq | Kudin, Vorob'ev, et al., 2007 | gas phase; value altered from reference due to conversion from electron convention to ion convention |
ΔrH° | 374. ± 10. | kJ/mol | TDEq | Khasanshin, Kudin, et al., 1999 | gas phase; value altered from reference due to conversion from electron convention to ion convention |

Ion clustering data

Data compiled by: John E. Bartmess
Clustering reactions
By formula: TbCl4- + Cl3Tb = Cl7Tb2-
Quantity | Value | Units | Method | Reference | Comment |
---|---|---|---|---|---|
ΔrH° | 242. ± 38. | kJ/mol | TDEq | Kudin, Vorob'ev, et al., 2007 | gas phase; value altered from reference due to conversion from electron convention to ion convention |
ΔrH° | 374. ± 10. | kJ/mol | TDEq | Khasanshin, Kudin, et al., 1999 | gas phase; value altered from reference due to conversion from electron convention to ion convention |

References

Kudin, Vorob'ev, et al., 2007
Kudin, L.S.; Vorob'ev, D.E.; Grishin, A.E.,
The Thermochemical Characteristics of the LnCl4- and Ln2Cl7- Negative Ions,
Russ. J. Phys. Chem., 2007, 81, 2, 147, https://doi.org/10.1134/S003602440702001X
. [all data]
Khasanshin, Kudin, et al., 1999
Khasanshin, I.V.; Kudin, L.S.; Pogrebnoi, A.M.,
A mass spectrometric study of saturated vapor over terbium trichloride and the TbCl3-DyCl3 system,
Russ. J. Phys. Chem., 1999, 73, 849-855. [all data]