GdO radical anion

Gas phase thermochemistry data

Data compiled by: John E. Bartmess

Quantity Value Units Method Reference Comment
Δfgas-186. ± 23.kJ/molR-EAKlingeler, Pontius, et al., 2002

References

Klingeler, Pontius, et al., 2002
Klingeler, R.; Pontius, N.; Luttgens, G.; Bechthold, P.S.; Neeb, M.; Eberhardt, W., Photoelectron spectroscopy of GdO-, Phys. Rev. A, 2002, 65, 3, no.-032, https://doi.org/10.1103/PhysRevA.65.032502 . [all data]