Ru6(CO)16 dianion

Gas phase ion energetics data

Data compiled by: John E. Bartmess

Electron affinity of neutral species

EAneutral (eV) Method Reference Comment
0.95 ± 0.10LPESButcher, Johnson, et al., 2002

References

Butcher, Johnson, et al., 2002
Butcher, C.P.G.; Johnson, B.F.G.; McIndoe, J.S.; Yang, X.; Wang, X.B.; Wang, L.S., Collision-induced dissociation and photodetachment of singly and doubly charged anionic polynuclear transition metal carbonyl clusters: Ru3Co(CO)(13)(-), Ru6C(CO)(16)(2-), and Ru- 6(CO)(18)(, J. Chem. Phys., 2002, 116, 15, 6560-6566, https://doi.org/10.1063/1.1462579 . [all data]