EtPH anion
- Formula: C2H6P-
- Molecular weight: 61.0434

Gas phase ion energetics data

Data compiled by: John E. Bartmess
Protonation reactions
By formula: C2H6P- + H+ = C2H7P
Quantity | Value | Units | Method | Reference | Comment |
---|---|---|---|---|---|
ΔrH° | 1563. ± 13. | kJ/mol | G+TS | Mo, Yanez, et al., 1999 | gas phase |
Quantity | Value | Units | Method | Reference | Comment |
ΔrG° | 1531. ± 12. | kJ/mol | IMRE | Mo, Yanez, et al., 1999 | gas phase |

Reaction thermochemistry data

Data compiled by: John E. Bartmess
Individual Reactions
By formula: C2H6P- + H+ = C2H7P
Quantity | Value | Units | Method | Reference | Comment |
---|---|---|---|---|---|
ΔrH° | 373.5 ± 3.1 | kcal/mol | G+TS | Mo, Yanez, et al., 1999 | gas phase |
Quantity | Value | Units | Method | Reference | Comment |
ΔrG° | 365.9 ± 2.8 | kcal/mol | IMRE | Mo, Yanez, et al., 1999 | gas phase |

References

Mo, Yanez, et al., 1999
Mo, O.; Yanez, M.; Decouzon, M.; Gal, J.F.; Maria, P.C.; Guillemin, J.L.,
Gas-phase basicity and acidity trends in alpha,beta-unsaturated amines, phosphines, and arsines,
J. Am. Chem. Soc., 1999, 121, 19, 4653-4663, https://doi.org/10.1021/ja982657e
. [all data]