coronene..Ti2 anion
- Formula: C24H12Ti2-
- Molecular weight: 396.087

Gas phase ion energetics data

Data compiled by: John E. Bartmess
Electron affinity of neutral species
EAneutral (eV) | Method | Reference | Comment |
---|---|---|---|
1.53 ± 0.13 | LPES | Duncan, Knight, et al., 2001 |

References

Duncan, Knight, et al., 2001
Duncan, M.A.; Knight, A.M.; Negishi, Y.; Nagao, S.; Judai, K.; Nakajima, A.; Kaya, K.,
Photoelectron spectroscopy of V-x(coronene)(y) and Ti- x(coronene)(y) anions,
J. Phys. Chem. A, 2001, 105, 44, 10093-10097, https://doi.org/10.1021/jp0122676
. [all data]