Cr34 anion

Gas phase ion energetics data

Data compiled by: John E. Bartmess

Electron affinity of neutral species

EAneutral (eV) Method Reference Comment
2.340 ± 0.080LPESWang, Wu, et al., 1997

References

Wang, Wu, et al., 1997
Wang, L.S.; Wu, H.; Cheng, H., Photoelectron Spectroscopy of Small Chromium Clusters: Observation of Even-Odd Alternation and Theoretical Interpretation, Phys. Rev. B: Cond. Matt., 1997, 55, 19, 12884, https://doi.org/10.1103/PhysRevB.55.12884 . [all data]