HSi4 anion

Gas phase ion energetics data

Data compiled by: John E. Bartmess

Electron affinity of neutral species

EAneutral (eV) Method Reference Comment
2.680 ± 0.010LPESXu, Taylor, et al., 1998

References

Xu, Taylor, et al., 1998
Xu, C.; Taylor, T.R.; Burton, G.R.; Neumark, D.M., Photoelectron Spectroscopy of SinH- (n=2-4) Anions, J. Chem. Phys., 1998, 108, 18, 7645, https://doi.org/10.1063/1.476200 . [all data]