(CF3)2C(Me)O anion
- Formula: C4H3F6O-
- Molecular weight: 181.0570

Gas phase ion energetics data

Data compiled by: John E. Bartmess
Protonation reactions
C4H3F6O- + = C4H4F6O
By formula: C4H3F6O- + H+ = C4H4F6O
Quantity | Value | Units | Method | Reference | Comment |
---|---|---|---|---|---|
ΔrH° | 348.2 ± 2.1 | kcal/mol | G+TS | Caldwell, McMahon, et al., 1985 | gas phase; value altered from reference due to change in acidity scale |
Quantity | Value | Units | Method | Reference | Comment |
ΔrG° | 340.6 ± 2.0 | kcal/mol | IMRE | Caldwell, McMahon, et al., 1985 | gas phase; value altered from reference due to change in acidity scale |

Reaction thermochemistry data

Data compiled by: John E. Bartmess

Individual Reactions

C4H3F6O- + Hydrogen cation = C4H4F6O

By formula: C4H3F6O- + H+ = C4H4F6O

Quantity Value Units Method Reference Comment
Δr1457. ± 8.8kJ/molG+TSCaldwell, McMahon, et al., 1985gas phase; value altered from reference due to change in acidity scale
Quantity Value Units Method Reference Comment
Δr1425. ± 8.4kJ/molIMRECaldwell, McMahon, et al., 1985gas phase; value altered from reference due to change in acidity scale

References

Caldwell, McMahon, et al., 1985
Caldwell, G.; McMahon, T.B.; Kebarle, P.; Bartmess, J.E.; Kiplinger, J.P.,
Methyl substituent effects in the gas phase acidities of halosubstituted oxygen acids. A realignment with substituent effects in solution,
J. Am. Chem. Soc., 1985, 107, 80. [all data]