CCl2=O..Cl anion

Gas phase thermochemistry data

Data compiled by: John E. Bartmess

Quantity Value Units Method Reference Comment
Δfgas-499.11kJ/molTherLarson and McMahon, 1985
Δfgas-460.2 ± 8.4kJ/molIMRBKarpas and Klein, 1976

References

Larson and McMahon, 1985
Larson, J.W.; McMahon, T.B., Fluoride and chloride affinities of the main group oxides, fluorides, oxofluorides, and alkyls. Quantitative scales of lewis acidities from ICR halide exchange equilibria, J. Am. Chem. Soc., 1985, 107, 766. [all data]

Karpas and Klein, 1976
Karpas, Z.; Klein, F.S., ICR study of the gas phase ion chemistry of the carbonyl halides: Cl2CO, F2CO and ClFCO, Int. J. Mass Spectrom. Ion Phys., 1976, 22, 189. [all data]