CF3CH(Me)O anion
- Formula: C3H4F3O-
- Molecular weight: 113.0590

Gas phase ion energetics data

Data compiled by: John E. Bartmess
Protonation reactions
By formula: C3H4F3O- + H+ = C3H5F3O
Quantity | Value | Units | Method | Reference | Comment |
---|---|---|---|---|---|
ΔrH° | 360.3 ± 2.1 | kcal/mol | G+TS | Caldwell, McMahon, et al., 1985 | gas phase; value altered from reference due to change in acidity scale |
Quantity | Value | Units | Method | Reference | Comment |
ΔrG° | 353.7 ± 2.0 | kcal/mol | IMRE | Caldwell, McMahon, et al., 1985 | gas phase; value altered from reference due to change in acidity scale |

References

Caldwell, McMahon, et al., 1985
Caldwell, G.; McMahon, T.B.; Kebarle, P.; Bartmess, J.E.; Kiplinger, J.P.,
Methyl substituent effects in the gas phase acidities of halosubstituted oxygen acids. A realignment with substituent effects in solution,
J. Am. Chem. Soc., 1985, 107, 80. [all data]