NH3..HO anion
- Formula: H4NO-
- Molecular weight: 34.0384

Reaction thermochemistry data

Data compiled by: John E. Bartmess
Individual Reactions
HO- + = H4NO-
Quantity | Value | Units | Method | Reference | Comment |
---|---|---|---|---|---|
ΔrH° | 50.21 | kJ/mol | N/A | Schwartz, Davico, et al., 2000 | gas phase; Vertical Detachment Energy: 2.54±0.015 eV. Affinity is from difference in EAs |

Gas phase ion energetics data

Data compiled by: John E. Bartmess
Electron affinity of neutral species
EAneutral (eV) | Method | Reference | Comment |
---|---|---|---|
2.350 ± 0.070 | LPES | Schwartz, Davico, et al., 2000 | Vertical Detachment Energy: 2.54±0.015 eV. Affinity is from difference in EAs |

Gas phase thermochemistry data

Data compiled by: John E. Bartmess

Quantity Value Units Method Reference Comment
Δfgas-234.6kJ/molTherSchwartz, Davico, et al., 2000Vertical Detachment Energy: 2.54±0.015 eV. Affinity is from difference in EAs

Ion clustering data

Data compiled by: John E. Bartmess

Clustering reactions

HO- + Ammonia = H4NO-

By formula: HO- + H3N = H4NO-

Quantity Value Units Method Reference Comment
Δr12.00kcal/molN/ASchwartz, Davico, et al., 2000gas phase; Vertical Detachment Energy: 2.54±0.015 eV. Affinity is from difference in EAs

References

Schwartz, Davico, et al., 2000
Schwartz, R.L.; Davico, G.E.; Kim, J.B.; Lineberger, C.W.,
Negative Ion Photoelectron Spectroscopy of OH-(NH3),
J. Chem. Phys., 2000, 112, 11, 4966, https://doi.org/10.1063/1.481051
. [all data]