NO..I anion
- Formula: INO-
- Molecular weight: 156.9111

Gas phase thermochemistry data

Data compiled by: John E. Bartmess
Quantity | Value | Units | Method | Reference | Comment |
---|---|---|---|---|---|
ΔfH°gas | -108.6 ± 0.96 | kJ/mol | Ther | Hiraoka, Iino, et al., 2000 |

References

Hiraoka, Iino, et al., 2000
Hiraoka, K.; Iino, T.; Eguchi, D.; Mizuno, T.; Yamabe, S.,
Dimer formation of NO ligands in the gas-phase halide ion clusters X-(NO)(n) enhanced by a frontier orbital interaction,
Chem. Phys. Lett., 2000, 323, 1-2, 155-159, https://doi.org/10.1016/S0009-2614(00)00503-0
. [all data]