(iPr)2CHO anion
- Formula: C7H15O-
- Molecular weight: 115.1939

Gas phase ion energetics data

Data compiled by: John E. Bartmess
Electron affinity of neutral species
EAneutral (eV) | Method | Reference | Comment |
---|---|---|---|
2.04 ± 0.16 | D-EA | Boand, Houriet, et al., 1983 | value altered from reference due to change in acidity scale |
Protonation reactions
By formula: C7H15O- + H+ = C7H16O
Quantity | Value | Units | Method | Reference | Comment |
---|---|---|---|---|---|
ΔrH° | 370.7 ± 3.1 | kcal/mol | G+TS | Boand, Houriet, et al., 1983 | gas phase; value altered from reference due to change in acidity scale |
Quantity | Value | Units | Method | Reference | Comment |
ΔrG° | 364.1 ± 3.0 | kcal/mol | CIDC | Boand, Houriet, et al., 1983 | gas phase; value altered from reference due to change in acidity scale |

Ion clustering data

Data compiled by: John E. Bartmess
Clustering reactions
By formula: H- = C7H15O-
Quantity | Value | Units | Method | Reference | Comment |
---|---|---|---|---|---|
ΔrH° | 43.3 ± 3.3 | kcal/mol | N/A | Boand, Houriet, et al., 1983 | gas phase; value altered from reference due to change in acidity scale |

Reaction thermochemistry data

Data compiled by: John E. Bartmess

Individual Reactions

C7H15O- + Hydrogen cation = 3-Pentanol, 2,4-dimethyl-

By formula: C7H15O- + H+ = C7H16O

Quantity Value Units Method Reference Comment
Δr370.7 ± 3.1kcal/molG+TSBoand, Houriet, et al., 1983gas phase; value altered from reference due to change in acidity scale
Quantity Value Units Method Reference Comment
Δr364.1 ± 3.0kcal/molCIDCBoand, Houriet, et al., 1983gas phase; value altered from reference due to change in acidity scale

Hydrogen anion = C7H15O-

By formula: H- = C7H15O-

Quantity Value Units Method Reference Comment
Δr43.3 ± 3.3kcal/molN/ABoand, Houriet, et al., 1983gas phase; value altered from reference due to change in acidity scale

References

Boand, Houriet, et al., 1983
Boand, G.; Houriet, R.; Baumann, T.,
The gas phase acidity of aliphatic alcohols,
J. Am. Chem. Soc., 1983, 105, 2203. [all data]