(NH3)2..Na2 radical anion

Gas phase ion energetics data

Data compiled by: John E. Bartmess

Electron affinity of neutral species

EAneutral (eV) Method Reference Comment
0.370 ± 0.050LPESTakasu, Ito, et al., 2000Stated electron affinity is the Vertical Detachment Energy

References

Takasu, Ito, et al., 2000
Takasu, R.; Ito, H.; Nishikawa, K.; Hashimoto, K.; Okuda, R.; Fuke, K., Solvation Process of Nam in Small Ammonia Clusters: Photoelectron Spectroscopy of Na(m)-(NH3)n, (m=3), J. Electron Spectros. Rel. Phenom., 2000, 106, 2-3, 127-139, https://doi.org/10.1016/S0368-2048(99)00071-7 . [all data]